{"text_format":"3","workbook":"xlsx","n_sheets":10,"sheets":["Table","Graph","List","Parameter","LED #1","LED #2","LED #3","LED #4","참조","History"],"not_rendered":{"charts":1,"images":2,"macros":1,"defined_names":67},"read":"whole","date_system":"1900"}

{"sheet":"Table","index":0,"n_rows":152,"n_cols":21,"rows_kept":152,"merged":[[1,2,1,3],[1,4,1,5],[1,7,1,9],[5,3,5,5],[5,8,5,10],[5,13,5,15],[5,18,5,20],[6,3,6,5],[6,8,6,10],[6,13,6,15],[6,18,6,20],[7,4,7,5],[7,9,7,10],[7,14,7,15],[7,19,7,20],[11,2,11,5],[11,7,11,10],[11,12,11,15],[11,17,11,20],[12,2,12,3],[12,4,12,5],[12,7,12,8],[12,9,12,10],[12,12,12,13],[12,14,12,15],[12,17,12,18],[12,19,12,20],[14,2,14,3],[14,4,14,5],[14,7,14,8],[14,9,14,10],[14,12,14,13],[14,14,14,15],[14,17,14,18],[14,19,14,20],[16,2,16,3],[16,4,16,5],[16,7,16,8],[16,9,16,10],[16,12,16,13],[16,14,16,15],[16,17,16,18],[16,19,16,20],[17,2,18,2],[17,3,18,3],[17,7,18,7],[17,8,18,8],[17,12,18,12],[17,13,18,13],[17,17,18,17],[17,18,18,18],[19,2,20,2],[19,3,20,3],[19,7,20,7],[19,8,20,8],[19,12,20,12],[19,13,20,13],[19,17,20,17],[19,18,20,18],[21,2,22,2],[21,3,22,3],[21,7,22,7],[21,8,22,8],[21,12,22,12],[21,13,22,13],[21,17,22,17],[21,18,22,18],[24,2,24,5],[24,7,24,10],[24,12,24,15],[24,17,24,20],[41,2,41,5],[41,7,41,10],[41,12,41,15],[41,17,41,20]]}
[]
[null,null,"Efficiency",null,"System Flux",null,null,"Current Display Range [A]"]
[null,null,"Optical","Driver","Target","Require",null,"Min.","Max.","Interval"]
[null,null,{"v":0.9,"d":"90.0%"},{"v":0.85,"d":"85.0%"},{"v":12000,"d":"12,000"},{"$f":"E4/C4","v":{"v":13333.333333333332,"d":"13,333"}},null,{"v":0.05,"d":"0.050"},{"v":1.5,"d":"1.500"},0.015]
[]
[null,null,"SSC","LED #1",{"$nulls":3},"SSC","LED #2",{"$nulls":4},"LED #3",{"$nulls":4},"LED #4"]
[null,null,5050,"STW0L8PA",{"$nulls":3},"Z5M3","SZ5-M3-Wx-C7"]
[null,null,{"v":70,"d":"CRI 70"},"Cool",{"$f":"IF(D7=\"\",\"\",VLOOKUP(D7,Parameter!$A:$F,6,0))","v":"5.0 x 5.0 x 0.7"},null,null,{"v":70,"d":"CRI 70"},"Cool",{"$f":"IF(I7=\"\",\"\",VLOOKUP(I7,Parameter!$A:$F,6,0))","v":"3.5 x 3.5 x 2.0"},{"$nulls":4},{"$f":"IF(N7=\"\",\"\",VLOOKUP(N7,Parameter!$A:$F,6,0))","v":""},{"$nulls":4},{"$f":"IF(S7=\"\",\"\",VLOOKUP(S7,Parameter!$A:$F,6,0))","v":""}]
[null,null,"Pd Group","Rth [℃/W]","IFBin","IFMAX",null,"Pd Group","Rth [℃/W]","IFBin","IFMAX",null,"Pd Group","Rth [℃/W]","IFBin","IFMAX",null,"Pd Group","Rth [℃/W]","IFBin","IFMAX"]
[null,null,"High",{"$f":"IF(D7=\"\",\"\",VLOOKUP(D7,Parameter!$A:$F,5,0))","v":2},{"$f":"IF(D7=\"\",\"\",VLOOKUP(D7,Parameter!$A:$F,3,0))","v":640},{"$f":"IF(D7=\"\",\"\",VLOOKUP(D7,Parameter!$A:$F,4,0))","v":800},null,"High",{"$f":"IF(I7=\"\",\"\",VLOOKUP(I7,Parameter!$A:$F,5,0))","v":3.2},{"$f":"IF(I7=\"\",\"\",VLOOKUP(I7,Parameter!$A:$F,3,0))","v":700},{"$f":"IF(I7=\"\",\"\",VLOOKUP(I7,Parameter!$A:$F,4,0))","v":1500},null,null,{"$f":"IF(N7=\"\",\"\",VLOOKUP(N7,Parameter!$A:$F,5,0))","v":""},{"$f":"IF(N7=\"\",\"\",VLOOKUP(N7,Parameter!$A:$F,3,0))","v":""},{"$f":"IF(N7=\"\",\"\",VLOOKUP(N7,Parameter!$A:$F,4,0))","v":""},null,null,{"$f":"IF(S7=\"\",\"\",VLOOKUP(S7,Parameter!$A:$F,5,0))","v":""},{"$f":"IF(S7=\"\",\"\",VLOOKUP(S7,Parameter!$A:$F,3,0))","v":""},{"$f":"IF(S7=\"\",\"\",VLOOKUP(S7,Parameter!$A:$F,4,0))","v":""}]
{"$rows_left_out":143}
{"sheet":"Graph","index":1,"n_rows":139,"n_cols":10,"rows_kept":139,"merged":[[3,1,3,2],[3,3,3,4],[33,6,33,7],[33,8,33,9],[37,1,38,1],[37,2,37,3],[37,4,37,5],[37,6,37,7],[37,8,37,9]]}
[]
[]
[]
[null,"Y-Value",null,"Scale Range"]
[null,"Unit","Decimal","min","max"]
[null,"PD",1]
{"$rows_empty":27}
[{"$nulls":6},"X-Value",null,"Scale Range"]
[{"$nulls":6},"Unit","Decimal","min","max"]
[{"$nulls":6},"VF",4]
{"$rows_left_out":104}
{"sheet":"List","index":2,"n_rows":671,"n_cols":12,"rows_kept":671,"hidden":true}
["Manufacturer","Power","PKG","CRI","Part-name","CCT","Spec","Rank","Min","Typ","Max","비고"]
["SSC","Mid","Y11-3V",70,"SZ8-Y11-Wx-C7-A","Cool","Flux","W1",64,{"$f":"+(K2-I2)/2+I2","v":66},{"$f":"+I3","v":68}]
["SSC","Mid","Y11-3V",70,"SZ8-Y11-Wx-C7-A","Cool","Flux","W2",68,70.5,{"$f":"+I4","v":73}]
["SSC","Mid","Y11-3V",70,"SZ8-Y11-Wx-C7-A","Cool","Flux","W3",73,75,77]
["SSC","Mid","Y11-3V",70,"SZ8-Y11-Wx-C7-A","Neutral","Flux","W1",64,66,{"$f":"+I6","v":68}]
["SSC","Mid","Y11-3V",70,"SZ8-Y11-Wx-C7-A","Neutral","Flux","W2",68,70.5,{"$f":"+I7","v":73}]
["SSC","Mid","Y11-3V",70,"SZ8-Y11-Wx-C7-A","Neutral","Flux","W3",73,75,77]
["SSC","Mid","Y11-3V",70,"SZ8-Y11-Wx-C7-A",null,"VF","G",2.55,{"$f":"+(K8-I8)/2+I8","v":2.675},2.8]
["SSC","Mid","Y11-3V",70,"SZ8-Y11-Wx-C7-A",null,"VF","H",2.8,2.925,3.05]
["SSC","Mid","Y11-3V",80,"SZ8-Y11-Wx-C8-A","Cool","Flux","V2",56,58,60]
{"$rows_left_out":662}
{"sheet":"Parameter","index":3,"n_rows":68,"n_cols":23,"rows_kept":68,"hidden":true,"merged":[[0,0,2,0],[0,1,1,3],[0,4,2,4],[0,5,2,5],[0,6,0,13],[0,14,0,21],[0,22,2,22],[1,6,1,9],[1,10,1,13],[1,14,1,17],[1,18,1,21]]}
["Part-name","Forward Current",null,null,"Rth","Size","@Current",{"$nulls":7},"@Temperature",{"$nulls":7},"Rev. Date"]
[{"$nulls":6},"Relative Flux",{"$nulls":3},"Relative VF",{"$nulls":3},"Relative Flux",{"$nulls":3},"Relative VF"]
[null,"min","typ","max",null,null,"y0","A1","t1","R-Square","y0","A1","t1","R-Square","y0","A1","t1","R-Square","y0","A1","t1","R-Square"]
["SZ8-Y11-Wx-C7-A",50,150,700,10,"1.1 x 1.1 x 0.4",7.43843,-7.43653,1055.48875,0.99996,1.22473,-0.30553,508.16278,0.99884,-1.80137,2.95359,1587.6193,0.99563,0.932,0.12085,146.83506,0.99059,"17/07/03"]
["SZ8-Y11-Wx-C7-C",20,115,230,10,"1.1 x 1.1 x 0.4",3.46516,-3.44036,344.07745,0.99991,1.16729,-0.28589,214.76656,0.99953,0.6787,0.49869,193.12126,0.99983,0.95153,0.11566,95.5272,0.99238,"17/07/03"]
["SZ8-Y11-Wx-C8-A",50,150,700,10,"1.1 x 1.1 x 0.4",7.43843,-7.43653,1055.48875,0.99996,1.22473,-0.30553,508.16278,0.99884,-1.80137,2.95359,1587.6193,0.99563,0.932,0.12085,146.83506,0.99059,"17/07/03"]
["SZ8-Y11-Wx-C9-A",50,150,700,10,"1.1 x 1.1 x 0.4",7.43843,-7.43653,1055.48875,0.99996,1.22473,-0.30553,508.16278,0.99884,-1.80137,2.95359,1587.6193,0.99563,0.932,0.12085,146.83506,0.99059,"18/10/14"]
["SZ8-Y11-Wx-C8-C",20,115,230,10,"1.1 x 1.1 x 0.4",3.46516,-3.44036,344.07745,0.99991,1.16729,-0.28589,214.76656,0.99953,0.6787,0.49869,193.12126,0.99983,0.95153,0.11566,95.5272,0.99238,"17/07/03"]
["SZ8-Y11-Wx-C9-C",20,115,230,10,"1.1 x 1.1 x 0.4",3.46516,-3.44036,344.07745,0.99991,1.16729,-0.28589,214.76656,0.99953,0.6787,0.49869,193.12126,0.99983,0.95153,0.11566,95.5272,0.99238,"17/07/03"]
["SZ8-Y11-Wx-C8-B",50,175,350,10,"1.1 x 1.1 x 0.4",3.12747,-3.108,459.34347,0.9999,1.28993,-0.42279,468.1007,0.9995,-1.14039,2.2779,1330.658,0.99894,0.95734,0.10718,91.45339,0.99898,"18/05/30"]
{"$rows_left_out":59}
{"sheet":"LED #1","index":4,"n_rows":114,"n_cols":14,"rows_kept":114,"hidden":true,"merged":[[1,0,1,1],[2,6,2,13],[3,6,3,9],[3,10,3,13],[7,6,7,13],[8,6,8,9],[8,10,8,13]]}
[]
[{"$f":"IF(Table!D7=\"\",NA(),Table!D7)","v":"STW0L8PA"},{"$nulls":5},7,{"$f":"G2+1","v":8},9,10,11,12,13,14]
[{"$nulls":6},"@Current"]
["Flux","VF",{"$nulls":4},"Relative Flux (FC)",{"$nulls":3},"Relative VF (VC)"]
[{"$f":"Table!C15","v":{"v":675,"d":"675.0"}},{"$f":"Table!E15","v":{"v":6.1,"d":"6.100"}},{"$nulls":4},"y0","A1","t1","R2","y0","A1","t1","R2"]
[{"$nulls":6},{"$f":"VLOOKUP($A$2,Parameter!$A:$W,G2,0)","v":{"v":5.39227,"d":"5.3923"}},{"$f":"VLOOKUP($A$2,Parameter!$A:$W,H2,0)","v":{"v":-5.39055,"d":"-5.3906"}},{"$f":"VLOOKUP($A$2,Parameter!$A:$W,I2,0)","v":{"v":3129.49751,"d":"3129.4975"}},{"$f":"VLOOKUP($A$2,Parameter!$A:$W,J2,0)","v":1},{"$f":"VLOOKUP($A$2,Parameter!$A:$W,K2,0)","v":{"v":1.44373,"d":"1.4437"}},{"$f":"VLOOKUP($A$2,Parameter!$A:$W,L2,0)","v":-0.5999},{"$f":"VLOOKUP($A$2,Parameter!$A:$W,M2,0)","v":{"v":2122.26731,"d":"2122.2673"}},{"$f":"VLOOKUP($A$2,Parameter!$A:$W,N2,0)","v":0.99986}]
["Ta/Tc [℃]","Rth","IOPPR. [mA]","Price [$]","Req.Flux",null,{"$f":"N2+1","v":15},{"$f":"G7+1","v":16},17,18,19,20,21,22]
[{"$f":"Table!D18","v":{"v":85,"d":"85.0"}},{"$f":"Table!D10","v":{"v":2,"d":"2.0"}},{"$f":"Table!D20","v":800},{"$f":"Table!D22","v":{"v":0,"d":"0.000"}},{"$f":"Table!$F$4","v":{"v":13333.333333333332,"d":"13,333"}},null,"@Temperature"]
[{"$nulls":6},"Relative Flux (FT)",{"$nulls":3},"Relative VF (VT)"]
["I. Interval","I. Range max","I. max",{"$nulls":3},"y0","A1","t1","R2","y0","A1","t1","R2"]
{"$rows_left_out":105}
{"sheet":"LED #2","index":5,"n_rows":114,"n_cols":14,"rows_kept":114,"hidden":true,"merged":[[1,0,1,1],[2,6,2,13],[3,6,3,9],[3,10,3,13],[7,6,7,13],[8,6,8,9],[8,10,8,13]]}
[]
[{"$f":"IF(Table!I7=\"\",NA(),Table!I7)","v":"SZ5-M3-Wx-C7"},{"$nulls":5},7,{"$f":"G2+1","v":8},9,10,11,12,13,14]
[{"$nulls":6},"@Current"]
["Flux","VF",{"$nulls":4},"Relative Flux (FC)",{"$nulls":3},"Relative VF (VC)"]
[{"$f":"Table!H15","v":{"v":320,"d":"320.0"}},{"$f":"Table!J15","v":2.875},{"$nulls":4},"y0","A1","t1","R2","y0","A1","t1","R2"]
[{"$nulls":6},{"$f":"VLOOKUP($A$2,Parameter!$A:$W,G2,0)","v":{"v":5.19474,"d":"5.1947"}},{"$f":"VLOOKUP($A$2,Parameter!$A:$W,H2,0)","v":{"v":-5.18128,"d":"-5.1813"}},{"$f":"VLOOKUP($A$2,Parameter!$A:$W,I2,0)","v":{"v":3300.72768,"d":"3300.7277"}},{"$f":"VLOOKUP($A$2,Parameter!$A:$W,J2,0)","v":0.99995},{"$f":"VLOOKUP($A$2,Parameter!$A:$W,K2,0)","v":{"v":1.63459,"d":"1.6346"}},{"$f":"VLOOKUP($A$2,Parameter!$A:$W,L2,0)","v":-0.7677},{"$f":"VLOOKUP($A$2,Parameter!$A:$W,M2,0)","v":{"v":3853.34348,"d":"3853.3435"}},{"$f":"VLOOKUP($A$2,Parameter!$A:$W,N2,0)","v":0.99865}]
["Ta/Tc [℃]","Rth","IOPPR. [mA]","Price [$]","Req.Flux",null,{"$f":"N2+1","v":15},{"$f":"G7+1","v":16},17,18,19,20,21,22]
[{"$f":"Table!I18","v":{"v":85,"d":"85.0"}},{"$f":"Table!I10","v":3.2},{"$f":"Table!I20","v":700},{"$f":"Table!I22","v":{"v":0,"d":"0.000"}},{"$f":"Table!$F$4","v":{"v":13333.333333333332,"d":"13,333"}},null,"@Temperature"]
[{"$nulls":6},"Relative Flux (FT)",{"$nulls":3},"Relative VF (VT)"]
["I. Interval","I. Range max","I. max",{"$nulls":3},"y0","A1","t1","R2","y0","A1","t1","R2"]
{"$rows_left_out":105}
{"sheet":"LED #3","index":6,"n_rows":114,"n_cols":14,"rows_kept":114,"hidden":true,"merged":[[1,0,1,1],[2,6,2,13],[3,6,3,9],[3,10,3,13],[7,6,7,13],[8,6,8,9],[8,10,8,13]]}
[]
[{"$f":"IF(Table!N7=\"\",NA(),Table!N7)","v":{"$error":"#N/A"}},{"$nulls":5},7,{"$f":"G2+1","v":8},9,10,11,12,13,14]
[{"$nulls":6},"@Current"]
["Flux","VF",{"$nulls":4},"Relative Flux (FC)",{"$nulls":3},"Relative VF (VC)"]
[{"$f":"Table!M15","v":{"$error":"#N/A"}},{"$f":"Table!O15","v":""},{"$nulls":4},"y0","A1","t1","R2","y0","A1","t1","R2"]
[{"$nulls":6},{"$f":"VLOOKUP($A$2,Parameter!$A:$W,G$2,0)","v":{"$error":"#N/A"}},{"$f":"VLOOKUP($A$2,Parameter!$A:$W,H$2,0)","v":{"$error":"#N/A"}},{"$f":"VLOOKUP($A$2,Parameter!$A:$W,I$2,0)","v":{"$error":"#N/A"}},{"$f":"VLOOKUP($A$2,Parameter!$A:$W,J$2,0)","v":{"$error":"#N/A"}},{"$f":"VLOOKUP($A$2,Parameter!$A:$W,K$2,0)","v":{"$error":"#N/A"}},{"$f":"VLOOKUP($A$2,Parameter!$A:$W,L$2,0)","v":{"$error":"#N/A"}},{"$f":"VLOOKUP($A$2,Parameter!$A:$W,M$2,0)","v":{"$error":"#N/A"}},{"$f":"VLOOKUP($A$2,Parameter!$A:$W,N$2,0)","v":{"$error":"#N/A"}}]
["Ta/Tc [℃]","Rth","IOPPR. [mA]","Price [$]","Req.Flux",null,{"$f":"N2+1","v":15},{"$f":"G7+1","v":16},17,18,19,20,21,22]
[{"$f":"Table!N18","v":{"v":85,"d":"85.0"}},{"$f":"Table!N10","v":""},{"$f":"Table!N20","v":1000},{"$f":"Table!N22","v":"."},{"$f":"Table!$F$4","v":{"v":13333.333333333332,"d":"13,333"}},null,"@Temperature"]
[{"$nulls":6},"Relative Flux (FT)",{"$nulls":3},"Relative VF (VT)"]
["I. Interval","I. Range max","I. max",{"$nulls":3},"y0","A1","t1","R2","y0","A1","t1","R2"]
{"$rows_left_out":105}
{"sheet":"LED #4","index":7,"n_rows":114,"n_cols":14,"rows_kept":114,"hidden":true,"merged":[[1,0,1,1],[2,6,2,13],[3,6,3,9],[3,10,3,13],[7,6,7,13],[8,6,8,9],[8,10,8,13]]}
[]
[{"$f":"IF(Table!S7=\"\",NA(),Table!S7)","v":{"$error":"#N/A"}},{"$nulls":5},7,{"$f":"G2+1","v":8},9,10,11,12,13,14]
[{"$nulls":6},"@Current"]
["Flux","VF",{"$nulls":4},"Relative Flux (FC)",{"$nulls":3},"Relative VF (VC)"]
[{"$f":"Table!R15","v":{"$error":"#N/A"}},{"$f":"Table!T15","v":""},{"$nulls":4},"y0","A1","t1","R2","y0","A1","t1","R2"]
[{"$nulls":6},{"$f":"VLOOKUP($A$2,Parameter!$A:$W,G$2,0)","v":{"$error":"#N/A"}},{"$f":"VLOOKUP($A$2,Parameter!$A:$W,H$2,0)","v":{"$error":"#N/A"}},{"$f":"VLOOKUP($A$2,Parameter!$A:$W,I$2,0)","v":{"$error":"#N/A"}},{"$f":"VLOOKUP($A$2,Parameter!$A:$W,J$2,0)","v":{"$error":"#N/A"}},{"$f":"VLOOKUP($A$2,Parameter!$A:$W,K$2,0)","v":{"$error":"#N/A"}},{"$f":"VLOOKUP($A$2,Parameter!$A:$W,L$2,0)","v":{"$error":"#N/A"}},{"$f":"VLOOKUP($A$2,Parameter!$A:$W,M$2,0)","v":{"$error":"#N/A"}},{"$f":"VLOOKUP($A$2,Parameter!$A:$W,N$2,0)","v":{"$error":"#N/A"}}]
["Ta/Tc [℃]","Rth","IOPPR. [mA]","Price [$]","Req.Flux",null,{"$f":"N2+1","v":15},{"$f":"G7+1","v":16},17,18,19,20,21,22]
[{"$f":"Table!S18","v":{"v":25,"d":"25.0"}},{"$f":"Table!S10","v":""},{"$f":"Table!S20","v":65},{"$f":"Table!S22","v":{"v":0.05,"d":"0.050"}},{"$f":"Table!$F$4","v":{"v":13333.333333333332,"d":"13,333"}},null,"@Temperature"]
[{"$nulls":6},"Relative Flux (FT)",{"$nulls":3},"Relative VF (VT)"]
["I. Interval","I. Range max","I. max",{"$nulls":3},"y0","A1","t1","R2","y0","A1","t1","R2"]
{"$rows_left_out":105}
{"sheet":"참조","index":8,"n_rows":11,"n_cols":6,"rows_kept":11,"hidden":true,"merged":[[0,0,0,1],[0,4,0,5]]}
["Rank",{"$nulls":3},"Group"]
["Range","Index",null,null,"Item","Index"]
["min",1,null,null,"IF",1]
["typ",2,null,null,"Flux",2]
["max",3,null,null,"VF",3]
[{"$nulls":4},"PD",4]
[{"$nulls":4},"TJ",5]
[{"$nulls":4},"lm/W",6]
[{"$nulls":4},"lm/$",7]
[{"$nulls":4},"# LEDs",8]
{"$rows_left_out":2}
{"sheet":"History","index":9,"n_rows":18,"n_cols":5,"rows_kept":18,"hidden":true}
[]
[]
[null,"Rev.","Date","Description","PIC"]
[null,"1.00","2017-07-05","Designer Tool 신규 생성","황대성/황수진"]
[]
[null,"2.15","2017-09-10","Added STW9Q14D and STW9Q14D-E3, error on Y22 Max and Typ Flux should be 285 and 278 respectively, also error in number of LEDs under LED performance and Lines 33 down."]
[null,"2.2","2017-10-07","System performance did not include Optical and Electrical loss this has been modified.  Added STW9C2SB, STW8A12D-E3, SAW9C22B-NZ, STW9A12D-E1, STW8A12D, SAW8A32E-E1, SAW8A42E-E1, SAW8A62E-E1, SAW9A32E-E1."]
[null,"2.21","2017-10-19","Z5M2 Parameters not coming up.  Parameter List and Configuration Tool part number mismatch.  Modified Parameter Table part number to match Configuration number."]
[null,"2.22_Designer","2018-01-29","Added W3 Flux bin for Y15-70CRI, Added SAW0L60A, SAW8L60A, Cree 3030_JB3030AWT, Osram 3030_GW PSLR31.EM, Added Y11-70CRI, Y11-90CRI, Updated Y11-80CRI flux bins, Corrected Y11-9V part number, Updated flux bins for Y15, Y19 and Y22, Designer Capability for Technical support(FAEs, Engineers, etc, NOT for sales)"]
[null,"2.22_Sales","2018-01-29","Sales version removes Designer Section and Competive parts"]
{"$rows_left_out":8}